{"text_format":"1","workbook":"xlsx","n_sheets":7,"sheets":["cat","Costilla de carpeta","Carátula (Guarda por expediente","Carátula carpeta multiples exp.","Separadores","Pestaña","Codigos"],"not_rendered":{"charts":0,"images":1,"macros":0,"external_links":1,"defined_names":76,"comments":0,"pivot_tables":0},"unopened":[],"bounds":{"document_bytes":16777216,"sheet_cells":100000,"rows_first":2000,"rows_last":500,"rows_between":2000,"halvings":0,"cell_chars":16384,"cell_head_chars":4096},"cells_cut":0,"cells_raw":0,"read":"whole","date_system":"1900"}

{"sheet":"cat","index":0,"n_rows":277,"n_cols":3,"rows_kept":277,"cut":false,"hidden":true,"merged":[]}
["CÓDIGO","ÁREA UNIVERSITARIA"]
[211,"Coordinación de Humanidades","COHU"]
[212,"Instituto de Investigaciones Bibliográficas","IIB"]
[213,"Instituto de Investigaciones Económicas","IIEC"]
[214,"Instituto de Investigaciones Estéticas","IIES"]
[215,"Instituto de Investigaciones Filosóficas","IIFS"]
[216,"Instituto de Investigaciones Históricas","IIH"]
[217,"Instituto de Investigaciones Jurídicas","IIJ"]
[218,"Instituto de Investigaciones Sociales","IIS"]
[219,"Instituto de Investigaciones Filológicas","IIFL"]
[221,"Instituto de Investigaciones Antropológicas","IIA"]
[222,"Instituto de Investigaciones sobre la Universidad y la Educación","IISUE"]
[223,"Instituto de Investigaciones Bibliotecológicas y de la Información","IIBI"]
[311,"Coordinación de la Investigación Científica","CIC"]
[312,"Instituto de Astronomía","IA"]
[313,"Instituto de Biología","IB"]
[314,"Instituto de Física","IF"]
[315,"Instituto de Geofísica","IGEF"]
[316,"Instituto de Geografía","IGEO"]
[317,"Instituto de Geología","IGEL"]
[318,"Instituto de Investigaciones Biomédicas","IIBM"]
[319,"Instituto de Matemáticas","IM"]
[321,"Instituto de Química","IQ"]
[322,"Instituto de Investigaciones en Matemáticas Aplicadas y en Sistemas","IIMAS"]
[323,"Instituto de Ingeniería","II"]
[324,"Instituto de Investigaciones en Materiales","IIM"]
[325,"Instituto de Ciencias del Mar y Limnología","ICML"]
[326,"Instituto de Fisiología Celular","IFC"]
[327,"Instituto de Ciencias Nucleares","ICN"]
[328,"Instituto de Biotecnología en Cuernavaca, Morelos","IBIT"]
[329,"Instituto de Ecología","IE"]
[331,"Instituto de Neurobiología en Querétaro, Querétaro","INEU"]
[332,"Instituto de Ciencias Físicas en Cuernavaca, Morelos","ICF"]
[333,"Instituto de Energías Renovables en Temixco, Morelos","IER"]
[334,"Instituto de Investigaciones en Ecosistemas y Sustentabilidad en Morelia, Michoacán","IIES"]
[335,"Instituto de Radioastronomía y Astrofísica en Morelia, Michoacán","IRyA"]
[336,"Instituto de Ciencias Aplicadas y Tecnología","ICAT"]
[411,"Facultad de Ciencias","FC"]
[412,"Facultad de Ciencias Políticas y Sociales","FCPyS"]
[413,"Facultad de Contaduría y Administración","FCA"]
[414,"Facultad de Derecho","FD"]
[415,"Facultad de Filosofía y Letras","FFyL"]
[416,"Facultad de Ingeniería","FING"]
[417,"Facultad de Medicina","FMED"]
[418,"Facultad de Química","FQUI"]
[419,"Facultad de Medicina Veterinaria y Zootecnia","FMVZ"]
[421,"Facultad de Odontología","FO"]
[422,"Facultad de Psicología","FP"]
[423,"Facultad de Economía","FE"]
[424,"Facultad de Arquitectura","FA"]
[425,"Facultad de Artes y Diseño","FAD"]
[426,"Facultad de Música","FaM"]
[434,"Escuela Nacional de Enfermería y Obstetricia","ENEO"]
[436,"Escuela Nacional de Trabajo Social","ENTS"]
[437,"Escuela Nacional de Lenguas, Lingüística y Traducción","ENALLT"]
[438,"Escuela Nacional de Ciencias de la Tierra","ENCT"]
[439,"Escuela Nacional de Artes Cinematográficas","ENAC"]
[441,"Facultad de Estudios Superiores Cuautitlán","FESC"]
[442,"Facultad de Estudios Superiores Acatlán","FESAC"]
[443,"Facultad de Estudios Superiores Iztacala","FESI"]
[444,"Facultad de Estudios Superiores Aragón","FESAR"]
[445,"Facultad de Estudios Superiores Zaragoza","FESZ"]
[446,"Escuela Nacional de Estudios Superiores, Unidad León, Guanajuato","ENESL"]
[447,"Escuela Nacional de Estudios Superiores, Unidad Morelia, Michoacán","ENESMO"]
[448,"Escuela Nacional de Estudios Superiores, Unidad Mérida, Yucatán","ENESME"]
[449,"Escuela Nacional de Estudios Superiores, Unidad Juriquilla, Querétaro","ENESJ"]
[451,"Dirección General Escuela Nacional Preparatoria","DGENP"]
[472,"Dirección General de la Escuela Nacional Colegio de Ciencias y Humanidades","DGCCH"]
[481,"Coordinación de Universidad Abierta, Innovación Educativa y Educación a Distancia","CUAIEED"]
[512,"Unidad Coordinadora de Servicios Académicos","UCSA"]
[513,"Coordinación General de Estudios de Posgrado","CGEP"]
[515,"Oficina del Consejo Académico del Bachillerato","OCAB"]
[522,"Dirección General de Cómputo y de Tecnologías de Información y Comunicación","DGTIC"]
[523,"Dirección General de Asuntos del Personal Académico","DGAPA"]
[525,"Unidad para el Fortalecimiento de la Docencia, la Investigación y la Extensión Universitaria","UFDIEU"]
[526,"Unidad para el Desarrollo de Planes y Programas","UDPP"]
[527,"Coordinación de Servicios Administrativos en Juriquilla, Querétaro","CSAJ"]
[529,"Coordinación de Servicios Administrativos en Morelia, Michoacán","CSAM"]
[532,"Coordinación de Vinculación con el Consejo Universitario","COVC"]
[533,"Coordinación de Servicios Administrativos, en Morelos","CSAMorelos"]
{"$rows_left_out":198}
{"sheet":"Costilla de carpeta","index":1,"n_rows":24,"n_cols":4,"rows_kept":24,"cut":false,"hidden":false,"merged":[[1,0,1,4],[3,0,3,4],[6,0,6,4],[8,0,8,4],[19,0,19,4],[11,0,11,4],[24,2,24,4],[25,0,25,4],[26,0,26,4],[51,0,51,4],[10,0,10,4],[12,0,12,4],[13,0,13,4],[20,3,20,4],[22,0,22,4],[14,0,14,4],[15,0,15,4],[23,0,23,4],[19,5,19,10],[9,0,9,4],[17,0,17,2],[17,3,17,4],[9,5,9,10],[12,5,12,10],[17,5,17,10],[15,5,15,10],[18,5,18,7],[18,8,18,10],[13,5,13,10],[14,5,14,10],[1,5,1,10],[3,5,3,10],[6,5,6,10],[8,5,8,10],[10,5,10,10]]}
[]
[]
[]
[]
[]
[]
["UNIVERSIDAD NACIONAL AUTÓNOMA DE MÉXICO"]
[]
["Código del Área "]
["Código del Área"]
[{"$f":"VLOOKUP(A10,cat!A2:B277,2,FALSE)","v":"Se genera al seleccionar el código del área universitaria"}]
["Fondo documental: "]
["UNAM"]
["_ELIGE_LA_SECCIÓN"]
["ELIGE LA SERIE"]
[]
[]
["(Anotar numero de expedientes resguardados en la carpeta",null,null,"EXPEDIENTES"]
[]
["NOMBRE DE CARPETA"]
[]
[]
[]
[2021]

{"sheet":"Carátula (Guarda por expediente","index":2,"n_rows":28,"n_cols":14,"rows_kept":28,"cut":false,"hidden":false,"merged":[[52,0,52,7],[1,0,1,7],[2,0,2,15],[10,2,10,13],[22,1,22,8],[22,9,22,14],[25,3,25,6],[25,9,25,13],[20,4,20,11],[26,1,26,13],[27,1,27,13],[8,1,8,4],[7,1,7,13],[9,1,9,13],[11,1,11,13],[3,0,3,15],[17,1,17,13],[18,1,18,13],[19,1,19,13],[12,1,12,13],[13,1,13,13],[14,1,14,13],[15,1,15,13],[16,1,16,13]]}
[]
[]
["CARÁTULA"]
[2021]
[]
[]
[]
["Sujeto obligado:","UNIVERSIDAD NACIONAL AUTÓNOMA DE MÉXICO"]
["Código del Área Universitaria:","Código del Área"]
["Área universitaria:",{"$f":"VLOOKUP(B9,cat!A2:B277,2,FALSE)","v":"Se genera al seleccionar el código del área universitaria"}]
["Fondo:",null,"UNAM"]
["Sección:","_ELIGE_LA_SECCIÓN"]
["Serie:","ELIGE LA SERIE"]
["Subserie:"]
["Número de expediente:"]
["Asunto:"]
["Número de legajo, tomo o volumen:"]
["Número de fojas:"]
["Fecha de apertura:"]
["Fecha de cierre:"]
[null,null,null,null,"Valores documentales"]
[]
[null,"Primarios",null,null,null,null,null,null,null,"Secundarios"]
[null,"A:",null,"L:",null,"F:",null,"C:",null,"E:",null,"T:",null,"I:"]
[]
["Plazos de conservación:",null,"AT:",null,null,null,null,null,"AC:"]
["Leyenda de clasificación:"]
["Código de clasificación"]

{"sheet":"Carátula carpeta multiples exp.","index":3,"n_rows":22,"n_cols":14,"rows_kept":22,"cut":false,"hidden":false,"merged":[[9,1,9,13],[1,0,1,7],[2,0,2,15],[7,1,7,13],[8,1,8,4],[3,0,3,15],[10,2,10,13],[11,1,11,13],[12,1,12,13],[13,1,13,13],[14,1,14,13],[20,3,20,6],[20,9,20,13],[21,1,21,13],[46,0,46,7],[15,4,15,11],[17,1,17,8],[17,9,17,14]]}
[]
[]
["CARÁTULA"]
[2021]
[]
[]
[]
["Sujeto obligado:","UNIVERSIDAD NACIONAL AUTÓNOMA DE MÉXICO"]
["Código del Área Universitaria:","Código del Área"]
["Área universitaria:",{"$f":"VLOOKUP(B9,cat!A2:B277,2,FALSE)","v":"Se genera al seleccionar el código del área universitaria"}]
["Fondo:",null,"UNAM"]
["Sección:","_ELIGE_LA_SECCIÓN"]
["Serie:","ELIGE LA SERIE"]
["Subserie:"]
["Cantidad de expedientes:"]
[null,null,null,null,"Valores documentales"]
[]
[null,"Primarios",null,null,null,null,null,null,null,"Secundarios"]
[null,"A:",null,"L:",null,"F:",null,"C:",null,"E:",null,"T:",null,"I:"]
[]
["Plazos de conservación:",null,"AT:",null,null,null,null,null,"AC:"]
["Leyenda de clasificación:"]

{"sheet":"Separadores","index":4,"n_rows":27,"n_cols":14,"rows_kept":27,"cut":false,"hidden":false,"merged":[[15,1,15,13],[1,0,1,7],[2,0,2,15],[7,1,7,13],[8,1,8,4],[9,1,9,13],[10,2,10,13],[11,1,11,13],[12,1,12,13],[13,1,13,13],[14,1,14,13],[3,0,3,15],[16,1,16,13],[17,1,17,13],[18,1,18,13],[19,4,19,11],[21,1,21,8],[21,9,21,14],[24,3,24,6],[24,9,24,13],[25,1,25,13],[26,1,26,13],[51,0,51,7]]}
[]
[]
["CARÁTULA"]
[2021]
[]
[]
[]
["Sujeto obligado:","UNIVERSIDAD NACIONAL AUTÓNOMA DE MÉXICO"]
["Código del Área Universitaria:","Código del Área"]
["Área universitaria:",{"$f":"VLOOKUP(B9,cat!A2:B277,2,FALSE)","v":"Se genera al seleccionar el código del área universitaria"}]
["Fondo:",null,"UNAM"]
["Sección:","_ELIGE_LA_SECCIÓN"]
["Serie:","ELIGE LA SERIE"]
["Subserie:"]
["Número de expediente:"]
["Asunto:"]
["Número de fojas:"]
["Fecha de apertura:"]
["Fecha de cierre:"]
[null,null,null,null,"Valores documentales"]
[]
[null,"Primarios",null,null,null,null,null,null,null,"Secundarios"]
[null,"A:",null,"L:",null,"F:",null,"C:",null,"E:",null,"T:",null,"I:"]
[]
["Plazos de conservación:",null,"AT:",null,null,null,null,null,"AC:"]
["Leyenda de clasificación:"]
["Código de clasificación"]

{"sheet":"Pestaña","index":5,"n_rows":43,"n_cols":2,"rows_kept":43,"cut":false,"hidden":false,"merged":[[37,2,37,7],[38,2,38,7],[41,2,41,7],[42,2,42,7],[25,2,25,7],[26,2,26,7],[29,2,29,7],[30,2,30,7],[33,2,33,7],[34,2,34,7],[22,2,22,7],[1,2,1,7],[2,2,2,7],[5,2,5,7],[6,2,6,7],[9,2,9,7],[10,2,10,7],[13,2,13,7],[14,2,14,7],[17,2,17,7],[18,2,18,7],[21,2,21,7]]}
[]
[null,"Código de clasificación"]
[null,"Nombre del expediente:"]
[]
[]
[null,"Código de clasificación"]
[null,"Nombre del expediente:"]
[]
[]
[null,"Código de clasificación"]
[null,"Nombre del expediente:"]
[]
[]
[null,"Código de clasificación"]
[null,"Nombre del expediente:"]
[]
[]
[null,"Código de clasificación"]
[null,"Nombre del expediente:"]
[]
[]
[null,"Código de clasificación"]
[null,"Nombre del expediente:"]
[]
[]
[null,"Código de clasificación"]
[null,"Nombre del expediente:"]
[]
[]
[null,"Código de clasificación"]
[null,"Nombre del expediente:"]
[]
[]
[null,"Código de clasificación"]
[null,"Nombre del expediente:"]
[]
[]
[null,"Código de clasificación"]
[null,"Nombre del expediente:"]
[]
[]
[null,"Código de clasificación"]
[null,"Nombre del expediente:"]

{"sheet":"Codigos","index":6,"n_rows":38,"n_cols":19,"rows_kept":38,"cut":false,"hidden":true,"merged":[]}
["SECCION",null,"1S DOCENCIA","2S INVESTIGACIÓN","3S DIFUSIÓN Y EXTENSIÓN DE LA CULTURA","4S GOBIERNO","1C LEGISLACIÓN UNIVERSITARIA","2C ASUNTOS JURÍDICOS","3C PLANEACIÓN, PROGRAMACIÓN, PRESUPUESTACIÓN, EVALUACIÓN Y ORGANIZACIÓN","4C RECURSOS HUMANOS","5C RECURSOS FINANCIEROS","6C RECURSOS MATERIALES Y OBRAS","7C SERVICIOS GENERALES","8C TECNOLOGÍAS DE LA INFORMACIÓN Y LA COMUNICACIÓN Y SERVICIOS DE LA INFORMACIÓN","9C COMUNICACIÓN SOCIAL","10C CONTRALORÍA","11C TRANSPARENCIA, ACCESO A LA INFORMACIÓN Y PROTECCIÓN DE DATOS PERSONALES","ELIGE LA SERIE"]
["_1S_DOCENCIA",null,".1 Disposiciones en materia de docencia",".1 Programas en materia de investigación",".1 Programas y proyectos en materia de difusión y extensión de la cultura",".1 Mensajes de autoridades",".1 Disposiciones en materia de legislación",".1 Programas y proyectos en materia de asuntos jurídicos",".1 Normas y políticas en materia de planeación, programación, presupuestación, evaluación y organización",".1 Programas y proyectos en materia de recursos humanos",".1 Programas y proyectos en materia de recursos financieros y contables",".1 Programas y proyectos en materia de recursos materiales, obras, conservación y mantenimiento",".1 Programas y proyectos en materia de servicios generales y movilidad",".1 Programas y proyectos en materia de tecnologías de la información y la comunicación",".1 Programas y proyectos en materia de comunicación social",".1 Programas y proyectos en materia de control y auditoría",".1 Programas y proyectos en materia de acceso a la información y protección de datos personales","ELIGE LA SERIE"]
["_2S_INVESTIGACIÓN",null,".2 Programas y proyectos en materia de docencia",".2 Proyectos de investigación",".2 Actividades culturales",".2 Sesiones de cuerpos colegiados",".2 Programas y proyectos en materia de legislación",".2 Actuaciones y representaciones",".2 Programas y proyectos en materia de planeación",".2 Trabajadores universitarios",".2 Egresos",".2 Adquisición, arrendamiento y servicios",".2 Atención a la salud",".2 Desarrollo e infraestructura de telecomunicaciones",".2 Publicaciones e impresos institucionales",".2 Auditoría, intervenciones y visitas de inspección",".2 Programas y proyectos en materia de transparencia"]
["_3S_DIFUSIÓN_Y_EXTENSIÓN_DE_LA_CULTURA",null,".3 Planes y programas de estudio",".3 Programas y proyectos de fomento y apoyo a la investigación","_.3_Programas_de_extensión_universitaria",".3 Dictámenes","_.3_Ordenamientos_jurídicos_universitarios",".3 Asistencias, asesorías y consultas",".3 Programas y proyectos en materia de presupuestación",".3 Registro y control de plazas",".3 Ingresos",".3 Obras",".3 Servicios básicos",".5 Supercómputo",".3 Material multimedia",".3 Requerimientos de información al área universitaria",".3 Solicitudes de acceso a la información"]
["_4S_GOBIERNO",null,"_.4_Incorporación_de_instituciones",".4 Programas de vinculación, colaboración, asesorías, estudios y diagnósticos",".4 Programas de extensión artística y cultural",".4 Nombramientos y designaciones",".4 Acuerdos",".4 Procedimientos donde la Universidad Nacional Autónoma de México es parte",".4 Programas y proyectos en materia de información y evaluación",".4 Nómina institucional",".4 Estados financieros",".4 Seguros y fianzas",".4 Servicios de seguridad y vigilancia",".6 Control de calidad de software y hardware",".4 Publicidad institucional",".4 Investigación por presuntas faltas administrativas",".4 Portal de transparencia"]
["_1C_LEGISLACIÓN_UNIVERSITARIA",null,"_.5_Revalidación_de_estudios_y_equivalencia_de_estudios",".5 Premios y distinciones en materia de investigación",".5 Publicación y fomento editorial",".5 Elecciones universitarias",".5 Lineamientos",".7 Procedimientos penales",".5 Programas y proyectos en materia de organización",".5 Reclutamiento y selección",".5 Libros contables",".5 Calidad en materia de obras, conservación y equipamiento",".5 Servicios de limpieza, higiene y fumigación",".7 Asesoría en tecnologías de la información, comunicación y servicios de la información",".5 Entrevistas para medios","_.5_Procedimientos_administrativos_en_forma_de_juicio",".5 Índices de expedientes clasificados"]
["_2C_ASUNTOS_JURÍDICOS",null,".6 Movilidad estudiantil",".6 Programas y proyectos de evaluación a la investigación",".6 Programas de desarrollo deportivo",".6 Resolución de conflictos entre autoridades universitarias",".6 Criterios de interpretación",".8 Procedimientos de investigación administrativa","_.6_Instrumentos_de_planeación_institucional",".6 Incidencias del personal",".6 Registro y control de pólizas de egresos",".6 Precios unitarios en obras y servicios",".6 Servicios de transporte, movilidad y estacionamientos",".8 Programas y proyectos en materia de informática",".6 Boletines informativos para medios",".6 Declaración de situación patrimonial y de intereses","_.7_Datos_personales"]
["_3C_PLANEACIÓN_PROGRAMACIÓN_PRESUPUESTACIÓN_EVALUACIÓN_Y_ORGANIZACIÓN",null,".7 Cooperación docente",null,".7 Programas de recreación universitaria",".7 Recomendaciones",".7 Instrumentos jurídicos consensuales","_.9_Procedimientos_administrativos_no_contenciosos",".7 Información estadística",".7 Descuentos",".7 Registro y control de pólizas de ingresos",".7 Asesoría técnica en materia de obras",".7 Servicios de telefonía, telefonía celular y radiocomunicación","_.10_Seguridad_informática",".7 Inserciones y anuncios en medios",".7 Entrega – recepción de cargo o puesto",".8 Recursos de revisión"]
["_4C_RECURSOS_HUMANOS",null,".8 Prácticas académicas",null,".8 Actividades deportivas",".8 Procedimientos disciplinarios sobre faltas a la Legislación Universitaria",".8 Registro y certificación de firmas","_.10_Pedimentos_solicitudes_y_requerimientos_no_contenciosos",".8 Programación presupuestal",".8 Estímulos",".8 Pólizas de diario",".8 Conservación, mantenimiento, remodelación y equipamiento",".8 Servicios de correspondencia y paquetería",".11 Análisis, desarrollo y programación de sistemas",".8 Cobertura de actos y eventos institucionales",".8 Libros blancos",".9 Resoluciones del Comité de Transparencia"]
["_5C_RECURSOS_FINANCIEROS",null,".9 Educación continua",null,".9 Premios y distinciones en materia de difusión y extensión de la cultura",".9 Premios, distinciones y reconocimientos recibidos por la Institución",null,".11 Trámites migratorios y consulares",".9 Indicadores de desempeño, calidad y productividad",".9 Concursos de oposición",".9 Auxiliares de cuentas",".9 Registro y control de proveedores y contratistas",".9 Mantenimiento, conservación e instalación de mobiliario",".12 Automatización de procesos",".9 Redes sociales",".9 Reclamación",".10 Obligaciones de transparencia"]
["_6C_RECURSOS_MATERIALES_Y_OBRAS",null,".10 Expediente único de alumnos y estudiantes",null,".10 Premios y distinciones al desarrollo deportivo",".10 Representación institucional",null,".12 Quejas y recomendaciones en materia de Derechos Humanos",".10 Dictamen técnico de estructuras administrativas",".10 Prestaciones contractuales",".10 Conciliaciones",".10 Registro y control del inventario de activo fijo",".10 Mantenimiento, conservación e instalación de equipo de cómputo",".13 Control y modernización de los recursos informáticos",null,".10 Revocación"]
["_7C_SERVICIOS_GENERALES",null,"_.11_Servicios_educativos",null,null,null,null,"_.13_Derechos_Universitarios",".11 Manuales de organización o procedimientos, normas y lineamientos de procesos y procedimientos",".11 Programas de retiro voluntario",".11 Asignación y optimización de recursos financieros",".11 Inventario físico y control de bienes muebles",".11 Control del parque vehicular",".14 Desarrollo, actualización y mantenimiento de página web institucional",null,".11 Programas y proyectos en materia de prevención y mejora Institucional"]
["_8C_TECNOLOGÍAS_DE_LA_INFORMACIÓN_Y_LA_COMUNICACIÓN_Y_SERVICIOS_DE_LA_INFORMACIÓN",null,".12 Becas",null,null,null,null,"_.14_Derechos_de_propiedad_industrial",".12 Programas de mejora administrativa",".12 Asuntos laborales",".12 Valores financieros",".12 Inventario físico y control de bienes inmuebles",".12 Control de combustible",".15 Programas y proyectos en materia de servicios de la información"]
["_9C_COMUNICACIÓN_SOCIAL",null,".13 Tutorías",null,null,null,null,"_.15_Derechos_de_autor",".13 Certificación de calidad de procesos y servicios",".13 Constancias y credenciales",".13 Estado del ejercicio del presupuesto",".13 Almacenamiento, control y abastecimiento de bienes y materiales",".13 Administración de auditorios, salas, estadios y otras instalaciones","_.16_Gestión_documental"]
["_10C_CONTRALORÍA",null,".14 Académicos",null,null,null,null,".16 Mecanismos alternativos de solución de controversias",".14 Desconcentración y descentralización de funciones académicas y administrativas",".14 Servicios profesionales",".14 Transferencias del presupuesto",".14 Control de calidad de bienes e insumos",".14 Programas y proyectos en materia de prevención y protección civil",".17 Administración de archivos"]
["_11C_TRANSPARENCIA_ACCESO_A_LA_INFORMACIÓN_Y_PROTECCIÓN_DE_DATOS_PERSONALES",null,".15 Apoyo a la docencia",null,null,null,null,null,".15 Programas y proyectos en materia de programación",".15 Pago por otros servicios",".15 Ampliaciones del presupuesto",".15 Control y seguimiento de obras, remodelaciones y equipamiento",".15 Capacitación y adiestramiento en materia de prevención y protección civil","_.18_Administración_de_bibliotecas"]
["_ELIGE_LA_SECCIÓN",null,".16 Convocatorias y premios académicos",null,null,null,null,null,null,".16 Capacitación y adiestramiento al personal",".16 Aportaciones a capital",".19 Control de material químico y / o biológico",".16 Análisis de riesgo",".19 Administración de otros centros de documentación"]
[null,null,".18 Titulación y graduación",null,null,null,null,null,null,".17 Premios y distinciones al personal",".17 Créditos concedidos",null,".17 Asesorías en materia de prevención y protección civil",".20 Administración y preservación de acervos digitales"]
[null,null,"_.19_Evaluación_e_innovación_educativa",null,null,null,null,null,null,".18 Banco de horas",".18 Cuentas por liquidar",null,null,".21 Procesos técnicos en los servicios de la información"]
[null,null,".20 Ingreso a la Universidad Nacional Autónoma de México",null,null,null,null,null,null,null,".19 Garantías, finanzas y depósitos",null,null,".23 Productos para la divulgación de servicios"]
[null,null,null,null,null,null,null,null,null,null,".20 Compras directas",null,null,".24 Servicios y productos de TIC"]
[null,null,null,null,null,null,null,null,null,null,".21 Control de cheques"]
[null,null,null,null,null,null,null,null,null,null,".22 Caja"]
[null,null,null,null,null,null,null,null,null,null,".23 Fondo fijo y revolvente"]
[null,null,null,null,null,null,null,null,null,null,".24 Inversiones"]
[null,null,null,null,null,null,null,null,null,null,".25 Fideicomisos"]
[null,null,null,null,null,null,null,null,null,null,".26 Cuenta anual"]
[null,null,null,null,null,null,null,null,null,null,".27 Bancos"]
[]
[]
[]
[null,"_.4_Incorporación_de_instituciones","_.5_Revalidación_de_estudios_y_equivalencia_de_estudios","_.11_Servicios_educativos","_.19_Evaluación_e_innovación_educativa","_.3_Programas_de_extensión_universitaria","_.3_Ordenamientos_jurídicos_universitarios","_.9_Procedimientos_administrativos_no_contenciosos","_.10_Pedimentos_solicitudes_y_requerimientos_no_contenciosos","_.13_Derechos_Universitarios","_.14_Derechos_de_propiedad_industrial","_.6_Instrumentos_de_planeación_institucional","_.10_Seguridad_informática","_.16_Gestión_documental","_.18_Administración_de_bibliotecas","_.5_Procedimientos_administrativos_en_forma_de_juicio","_.7_Datos_personales",null,"_.15_Derechos_de_autor"]
[null,".4 .1 Planes y programas de estudio incorporados",".5 .1 Planes, tablas y programas de estudio",".11 .1 Programas de servicio social",".19 .1 Evaluaciones y exámenes",".3 .1 Vinculación con egresados de la Universidad Nacional Autónoma de México",".3 .1 Estatutos",".9 .1 Revisiones fiscales",".10 .1 Pedimentos, solicitudes y requerimientos de autoridad competente en materia penal",".13 .1 Quejas y recomendaciones en materia de Derechos Universitarios",".14 .1 Marcas",".6 .1 Plan de Desarrollo Institucional",".10 .1 Identidad digital",".16 .1 Procesos de la gestión documental",".18 .1 Adquisiciones bibliográficas",".5 .1 Procedimientos de responsabilidad administrativa",".7 .1 Derechos ARCO",null,".15 Obras artísticas y literarias"]
[null,".4 .2 Supervisiones a las instituciones incorporadas",".5 .2 Validez académica",".11 .2 Prestación y liberación del servicio social",".19 .2 Evaluación de la docencia, tutoría y enseñanza colectiva",".3 .2 Extensión universitaria",".3 .2 Reglamentos",".9 .2 Inspecciones",".10 .2 Pedimentos, solicitudes y requerimientos judiciales",".13 .2 Remisiones",".14 .2 Avisos y nombres comerciales",".6 .2 Programa de trabajo institucional",".10 .2 Seguridad de la información",".16 .2 Destino Final de la Documentación",".18 .2 Proceso técnico",".5 .2 Inconformidades",".7 .2 Procedimiento de verificación en materia de protección de datos personales",null,".15 Registro legal de publicaciones periódicas"]
[null,".4 .3 Asesoría, orientación y consulta sobre el proceso de incorporación de estudios a la Universidad Nacional Autónoma de México",".5 .3 Equivalencia de estudios, títulos y grados",".11 .3 Orientación educativa",".19 .3 Seguimiento de egresados y estudios con empleadores y expertos",null,null,".9 .3 Importaciones",".10 .3 Solicitud de peritos",null,".14 .3 Patentes",".6 .3 Informe institucional",null,null,".18 .3 Descarte de material o baja",".5 .3 Sanciones a proveedores y contratistas"]
[null,".4 .4 Calendario académico y administrativo del sistema incorporado",".5 .4 Opinión académica de estudios",".11 .4 Vinculación de alumnos, estudiantes y egresados",null,null,null,null,null,null,".14 .4 Modelos de utilidad",".6 .4 Planes de desarrollo de las áreas universitarias",null,null,".18 .4 Servicios bibliotecarios y de información"]
[null,".4 .5 Directores técnicos y profesorado de las instituciones incorporadas",".5 .5 Asesoría, orientación y consulta en materia de revalidación y equivalencia de estudios",null,null,null,null,null,null,null,".14 .5 Diseños industriales",".6 .5 Programas de trabajo de las áreas universitarias",null,null,".18 .5 Cooperación bibliotecaria"]
[null,null,null,null,null,null,null,null,null,null,".14 .6 Variedades vegetales",".6 .6 Informes"]